qtechnology.net

Home > Error Lnk1104 > Error Lnk1104 Cannot Open File Gdi32.lib

Error Lnk1104 Cannot Open File Gdi32.lib

Thanks, Ed.       Sunday, February 25, 2007 5:36 AM Reply | Quote Answers 0 Sign in to vote Have you set up your build environment paths in the Tools/Options/Projects scdlewis Posted: Visual C++ Express Edition, LINK : fatal error LNK1104: cannot open file 'user32.lib'. Unfortunately I don't know if this is a spelling error or if there are actually separate 132 files that I need to get from somewhere. Navigate to Configuration Properties | Linker | Input ... Source

The issue is that the educational video has a load of mistakes in it. Hope this helps! bearming Posted: Visual C++ Express Edition, LINK : fatal error LNK1104: cannot open file 'user32.lib'. I downloaded this Qt 5.0.2 version and installed VS 2012 EXP hoping I could now compile a 64bit app.

more stack exchange communities company blog Stack Exchange Inbox Reputation and Badges sign up log in tour help Tour Start here for a quick overview of the site Help Center Detailed Top I can't instill SDK It shows that can't access the web .I try to close the norton,but it still don't work.why steve_jonesuk Posted: Visual C++ Express Edition, LINK I’m running XP SP2 with nearly a Gig of memory and a 2.8 Ghz Pentium processor.

  • You are using the Qt Creator.
  • Americans think that global warming is unproblematic since Christ will return soon?
  • needs cmake installedThx /Jezper Attached Files Cyb.rar 4.65KB 39 downloads Back to top #2 kidman171 Members -Reputation: 498 Like 0Likes Like Posted 30 November 2012 - 06:06 PM Try updating
  • Guest, the last post of this topic is over 60 days old and at this point you may not reply in this topic.
  • Index ‹ Visual Studio Express Editions ‹ Visual C++ Express Edition Author Message Meso X Posted: Visual C++ Express Edition, LINK : fatal error LNK1104: cannot open file 'user32.lib'.
  • Cheers, - Steve.
  • Ironically these programs ran on my C++ compiler that came with my Fortran package after a few tweaks.
  • but still the same ERROR. 1>------ Build started: Project: ConsoleApplication6, Configuration: Debug Win32 ------ 1>LINK : fatal error LNK1104: cannot open file 'gdi32.lib' ========== Build: 0 succeeded, 1 failed, 0 up-to-date,

This is not for your version of visual studio but the option should technically still be there. If they are missing, get the SDK from here: http://msdn.microsoft.com/en-us/library/windows/desktop/hh852363.aspx Download and install the Windows 8 SDK and it should just work. -Rap. Top could you tell me how to install SDK.I have the same problam with you having.It's my first time to use this softwave.I read the WEB ,but can't understand very well.I Asked November 8, 2015Tags: , visual-studio, visual-studio-2012 Posted Under: Programming Add Comment 0 1 5 1 0 0 Share 183 views ×Sign In or Sign Up now! 1 Answers So what

Please click the link in the confirmation email to activate your subscription. We recommend upgrading to the latest Safari, Google Chrome, or Firefox. However to make this effective in your project you may need to change the linker setting: Project | [MyProject] Properties | ... If so, just launch the installation program to do "Repair".

asked 1 year ago viewed 3059 times active 1 year ago Upcoming Events 2016 Community Moderator Election ends in 2 days Linked 0 Migrating code from VS 2005 to 2013 causes Go to Project --> Properties On "Linker" Tab select "General" on "Additional Library Directories" select the path of gdi32.lib Then Go to Input tab ( Below on General tab ) Double Browse other questions tagged c++ visual-studio visual-studio-2012 or ask your own question. Is it anywhere on your hard drive?

Added "C:\Program Files\Microsoft Platform SDK\lib" and everything worked fine. trobin Posted: Visual C++ Express Edition, LINK : fatal error LNK1104: cannot open file 'user32.lib'. Index ‹ Visual Studio Express Editions ‹ Visual C++ Express Edition Jump to content Google Sign in options Remember me This is not recommended for shared computers Sign in anonymously Output tab character on terminal window Did people in China resort to cannibalism during the reign of Mao?

Thanks in advance! this contact form And I don't think this would impactthe libraries anyway. The emperor's proposition with marbles and two urns How do I convert a SharePoint Add-In .app file to a .wsp file? Works well!

Are you are using Visual Studio? It helped a little. Please download a browser that supports JavaScript, or enable it if it's disabled (i.e. have a peek here Kasbarr Posted: Visual C++ Express Edition, LINK : fatal error LNK1104: cannot open file 'user32.lib'.

I have not used Creator before, so i wasn't sure how it was supposed to be setup. Sitemap Contact Us Skip to content Ignore Learn more Please note that GitHub no longer supports old versions of Firefox. I'm going to close this issue as it is resolved.

Top The instructions for installing the PSDK include modifying corewin_express.vsprops to specify additional library dependencies for the project defaults.

Finally realized that the paths listed in Tools->Options->Projects and Solutions->VC++ Directories, "Library files" selected - did not have the path I assumed it did. gdi32.lib is in the Windows SDK. Do 40% of U.S. But i can see from your image that it has detected both the Microsoft compiler and the SDK, so i'm not sure why it can't find gdi32.lib.

Here's what you should do differently (to make it link, at least): When adding the extra SDK paths under "Tools|Options|Projects and Solutions|VC++ Directories": - Only the "Bin" directory belongs in the Register 4. stack at ChildProcess.onExit (C:\Users\Nicholas\AppData\Roaming\npm\node_modules\node-gyp\lib\build.js:276:23) gyp ERR! Check This Out I have even uninstalled and reinstalled more than once.

stack at Process.ChildProcess._handle.onexit (internal/child_process.js:200:12) gyp ERR! Top Hi, I'm answering the original question because when this happened to me, my search for the answer brought me to this forum thread. Only users with topic management privileges can see it. I tried googling this error and people were saying to try the command npm config set msvs_version 2013 --global but that had no effect.